Reaction Details
TargetEpidermal growth factor receptor
LigandBDBM50278538
Substrate/Competitorn/a
Meas. Tech.ChEMBL_501564 (CHEMBL987693)
IC50 14±n/a nM
Citation Lin, RJohnson, SGConnolly, PJWetter, SKBinnun, EHughes, TVMurray, WVPandey, NBMoreno-Mazza, SJAdams, MFuentes-Pesquera, ARMiddleton, SA Synthesis and evaluation of 2,7-diamino-thiazolo[4,5-d] pyrimidine analogues as anti-tumor epidermal growth factor receptor (EGFR) tyrosine kinase inhibitors. Bioorg Med Chem Lett19:2333-7 (2009) 
 
Epidermal growth factor receptor
Name:Epidermal growth factor receptor
Type:Receptor Kinase Domain
Mol. Mass.:134279.59
Organism:Homo sapiens (Human)
Description:P00533
Residue:1210
BDBM50278538
NameBDBM50278538
Synonyms:4-(7-(m-tolylamino)thiazolo[4,5-d]pyrimidin-2-ylamino)benzenesulfonamide | CHEMBL513362
TypeSmall organic molecule
Emp. Form.C18H16N6O2S2
Mol. Mass.412.489
SMILESCc1cccc(Nc2ncnc3nc(Nc4ccc(cc4)S(N)(=O)=O)sc23)c1