Reaction Details
TargetCathepsin B
LigandBDBM50257018
Substrate/Competitorn/a
Meas. Tech.ChEMBL_562602 (CHEMBL1016183)
Ki 7300±n/a nM
Citation Ettari, RMicale, NSchirmeister, TGelhaus, CLeippe, MNizi, EDi Francesco, MEGrasso, SZappalà, M Novel peptidomimetics containing a vinyl ester moiety as highly potent and selective falcipain-2 inhibitors. J Med Chem52:2157-60 (2009) 
 
Cathepsin B
Name:Cathepsin B
Type:Enzyme
Mol. Mass.:37819.69
Organism:Homo sapiens (Human)
Description:gi_63102437
Residue:339
BDBM50257018
NameBDBM50257018
Synonyms:(E)-methyl4-(2-((R,Z)-3-((4-chloro-2-(trifluoromethyl)phenylcarbamoyloxy)methyl)-2-oxo-5-phenyl-2,3-dihydro-1H-benzo[e][1,4]diazepin-1-yl)acetamido)but-2-enoate CHEMBL501901
TypeSmall organic molecule
Emp. Form.C31H26ClF3N4O6
Mol. Mass.643.01
SMILESCOC(=O)\C=C\CNC(=O)CN1c2ccccc2C(=N[C@H](COC(=O)Nc2ccc(Cl)cc2C(F)(F)F)C1=O)c1ccccc1