Reaction Details
TargetCathepsin B
LigandBDBM50257019
Substrate/Competitorn/a
Meas. Tech.ChEMBL_562602 (CHEMBL1016183)
Ki 9900±n/a nM
Citation Ettari, RMicale, NSchirmeister, TGelhaus, CLeippe, MNizi, EDi Francesco, MEGrasso, SZappalà, M Novel peptidomimetics containing a vinyl ester moiety as highly potent and selective falcipain-2 inhibitors. J Med Chem52:2157-60 (2009) 
 
Cathepsin B
Name:Cathepsin B
Type:Enzyme
Mol. Mass.:37819.69
Organism:Homo sapiens (Human)
Description:gi_63102437
Residue:339
BDBM50257019
NameBDBM50257019
Synonyms:(4-Chloro-2-trifluoromethyl-phenyl)-carbamic acid 1-[(3-cyano-allylcarbamoyl)-methyl]-(3R)-2-oxo-5-phenyl-2,3-dihydro-1H-benzo[e][1,4]diazepin-3-ylmethyl ester | CHEMBL504183
TypeSmall organic molecule
Emp. Form.C30H23ClF3N5O4
Mol. Mass.609.983
SMILESFC(F)(F)c1cc(Cl)ccc1NC(=O)OC[C@H]1N=C(c2ccccc2)c2ccccc2N(CC(=O)NC\C=C\C#N)C1=O