Reaction Details
TargetCoagulation factor X
LigandBDBM50249295
Substrate/Competitorn/a
Meas. Tech.ChEMBL_499722 (CHEMBL968695)
IC50 3±n/a nM
Citation Zhang, PHuang, WWang, LBao, LJia, ZJBauer, SMGoldman, EAProbst, GDSong, YSu, TFan, JWu, YLi, WWoolfrey, JSinha, UWong, PWEdwards, STArfsten, AEClizbe, LAKanter, JPandey, APark, GHutchaleelaha, ALambing, JLHollenbach, SJScarborough, RMZhu, BY Discovery of betrixaban (PRT054021), N-(5-chloropyridin-2-yl)-2-(4-(N,N-dimethylcarbamimidoyl)benzamido)-5-methoxybenzamide, a highly potent, selective, and orally efficacious factor Xa inhibitor. Bioorg Med Chem Lett19:2179-85 (2009) 
 
Coagulation factor X
Name:Coagulation factor X
Type:Enzyme
Mol. Mass.:54726.60
Organism:Homo sapiens (Human)
Description:n/a
Residue:488
BDBM50249295
NameBDBM50249295
Synonyms:CHEMBL471725 N-(5-chloropyridin-2-yl)-2-(4-(N,N-dimethylcarbamimidoyl)benzamido)benzamide
TypeSmall organic molecule
Emp. Form.C22H20ClN5O2
Mol. Mass.421.88
SMILESCN(C)C(=N)c1ccc(cc1)C(=O)Nc1ccccc1C(=O)Nc1ccc(Cl)cn1