Reaction Details
TargetCoagulation factor X
LigandBDBM50249326
Substrate/Competitorn/a
Meas. Tech.ChEMBL_499722 (CHEMBL968695)
IC50 0.6±n/a nM
Citation Zhang, PHuang, WWang, LBao, LJia, ZJBauer, SMGoldman, EAProbst, GDSong, YSu, TFan, JWu, YLi, WWoolfrey, JSinha, UWong, PWEdwards, STArfsten, AEClizbe, LAKanter, JPandey, APark, GHutchaleelaha, ALambing, JLHollenbach, SJScarborough, RMZhu, BY Discovery of betrixaban (PRT054021), N-(5-chloropyridin-2-yl)-2-(4-(N,N-dimethylcarbamimidoyl)benzamido)-5-methoxybenzamide, a highly potent, selective, and orally efficacious factor Xa inhibitor. Bioorg Med Chem Lett19:2179-85 (2009) 
 
Coagulation factor X
Name:Coagulation factor X
Type:Enzyme
Mol. Mass.:54726.60
Organism:Homo sapiens (Human)
Description:n/a
Residue:488
BDBM50249326
NameBDBM50249326
Synonyms:5-chloro-N-(5-chloropyridin-2-yl)-2-(4-(N,N-dimethylcarbamimidoyl)benzamido)-3-methoxybenzamide | CHEMBL515545
TypeSmall organic molecule
Emp. Form.C23H21Cl2N5O3
Mol. Mass.486.351
SMILESCOc1cc(Cl)cc(C(=O)Nc2ccc(Cl)cn2)c1NC(=O)c1ccc(cc1)C(=N)N(C)C