Reaction Details
TargetPotassium voltage-gated channel subfamily H member 2
LigandBDBM50249120
Substrate/Competitorn/a
Meas. Tech.ChEMBL_499727 (CHEMBL968700)
Ki 420±n/a nM
Citation Zhang, PHuang, WWang, LBao, LJia, ZJBauer, SMGoldman, EAProbst, GDSong, YSu, TFan, JWu, YLi, WWoolfrey, JSinha, UWong, PWEdwards, STArfsten, AEClizbe, LAKanter, JPandey, APark, GHutchaleelaha, ALambing, JLHollenbach, SJScarborough, RMZhu, BY Discovery of betrixaban (PRT054021), N-(5-chloropyridin-2-yl)-2-(4-(N,N-dimethylcarbamimidoyl)benzamido)-5-methoxybenzamide, a highly potent, selective, and orally efficacious factor Xa inhibitor. Bioorg Med Chem Lett19:2179-85 (2009) 
 
Potassium voltage-gated channel subfamily H member 2
Name:Potassium voltage-gated channel subfamily H member 2
Type:Multi-pass membrane protein
Mol. Mass.:126672.65
Organism:Homo sapiens (Human)
Description:Q12809
Residue:1159
BDBM50249120
NameBDBM50249120
Synonyms:CHEMBL472967 | N-(4-chloro-2-(5-chloropyridin-2-ylcarbamoyl)phenyl)-4-(N,N-dimethylcarbamimidoyl)-2-fluorobenzamide
TypeSmall organic molecule
Emp. Form.C22H18Cl2FN5O2
Mol. Mass.474.315
SMILESCN(C)C(=N)c1ccc(C(=O)Nc2ccc(Cl)cc2C(=O)Nc2ccc(Cl)cn2)c(F)c1