Reaction Details
TargetProthrombin
LigandBDBM50193861
Substrate/Competitorn/a
Meas. Tech.ChEMBL_499729 (CHEMBL968702)
IC50>10000±n/a nM
Citation Zhang, PHuang, WWang, LBao, LJia, ZJBauer, SMGoldman, EAProbst, GDSong, YSu, TFan, JWu, YLi, WWoolfrey, JSinha, UWong, PWEdwards, STArfsten, AEClizbe, LAKanter, JPandey, APark, GHutchaleelaha, ALambing, JLHollenbach, SJScarborough, RMZhu, BY Discovery of betrixaban (PRT054021), N-(5-chloropyridin-2-yl)-2-(4-(N,N-dimethylcarbamimidoyl)benzamido)-5-methoxybenzamide, a highly potent, selective, and orally efficacious factor Xa inhibitor. Bioorg Med Chem Lett19:2179-85 (2009) 
 
Prothrombin
Name:Prothrombin
Type:Protein
Mol. Mass.:70029.57
Organism:Homo sapiens (Human)
Description:P00734
Residue:622
BDBM50193861
NameBDBM50193861
Synonyms:5-chloro-N-(5-chloro-pyridin-2-yl)-2-[4-(N,N-dimethyl-carbamimidoyl)-benzoylamino]-benzamide CHEMBL221906
TypeSmall organic molecule
Emp. Form.C22H19Cl2N5O2
Mol. Mass.456.325
SMILESCN(C)C(=N)c1ccc(cc1)C(=O)Nc1ccc(Cl)cc1C(=O)Nc1ccc(Cl)cn1