Reaction Details
TargetVitamin K-dependent protein C
LigandBDBM50249298
Substrate/Competitorn/a
Meas. Tech.ChEMBL_499732 (CHEMBL968705)
IC50>10000±n/a nM
Citation Zhang, PHuang, WWang, LBao, LJia, ZJBauer, SMGoldman, EAProbst, GDSong, YSu, TFan, JWu, YLi, WWoolfrey, JSinha, UWong, PWEdwards, STArfsten, AEClizbe, LAKanter, JPandey, APark, GHutchaleelaha, ALambing, JLHollenbach, SJScarborough, RMZhu, BY Discovery of betrixaban (PRT054021), N-(5-chloropyridin-2-yl)-2-(4-(N,N-dimethylcarbamimidoyl)benzamido)-5-methoxybenzamide, a highly potent, selective, and orally efficacious factor Xa inhibitor. Bioorg Med Chem Lett19:2179-85 (2009) 
 
Vitamin K-dependent protein C
Name:Vitamin K-dependent protein C
Type:Enzyme
Mol. Mass.:52067.73
Organism:Homo sapiens (Human)
Description:n/a
Residue:461
BDBM50249298
NameBDBM50249298
Synonyms:BEVYXXA N-(5-chloropyridin-2-yl)-2-(4-(N,N-dimethylcarbamimidoyl)benzamido)-5-methoxybenzamide | betrixaban
TypeSmall organic molecule
Emp. Form.C23H22ClN5O3
Mol. Mass.451.905
SMILESCOc1ccc(NC(=O)c2ccc(cc2)C(=N)N(C)C)c(c1)C(=O)Nc1ccc(Cl)cn1