Reaction Details
TargetChitinase C1
LigandBDBM50257240
Substrate/Competitorn/a
Meas. Tech.ChEMBL_562671 (CHEMBL1011830)
IC50>30000±n/a nM
Citation Sunazuka, TSugawara, AIguchi, KHirose, TNagai, KNoguchi, YSaito, YYamamoto, TUi, HGouda, HShiomi, KWatanabe, TOmura, S Argifin; efficient solid phase total synthesis and evaluation of analogues of acyclic peptide. Bioorg Med Chem17:2751-8 (2009) 
 
Chitinase C1
Name:Chitinase C1
Synonyms:n/a
Type:PROTEIN
Mol. Mass.:51761.96
Organism:Serratia marcescens
Description:ChEMBL_562671
Residue:480
BDBM50257240
NameBDBM50257240
TypeSmall organic molecule
Emp. Form.C27H39N7O8
Mol. Mass.589.6407
SMILESCNC(=O)NC(N)=NCCC[C@H](NC(C)=O)C(=O)N(C)[C@@H](Cc1ccccc1)C(=O)N[C@@H](CC(=O)OCC=C)C(O)=O