Reaction Details
TargetChitinase C1
LigandBDBM50257245
Substrate/Competitorn/a
Meas. Tech.ChEMBL_562671 (CHEMBL1011830)
IC50>30000±n/a nM
Citation Sunazuka, TSugawara, AIguchi, KHirose, TNagai, KNoguchi, YSaito, YYamamoto, TUi, HGouda, HShiomi, KWatanabe, TOmura, S Argifin; efficient solid phase total synthesis and evaluation of analogues of acyclic peptide. Bioorg Med Chem17:2751-8 (2009) 
 
Chitinase C1
Name:Chitinase C1
Synonyms:n/a
Type:PROTEIN
Mol. Mass.:51761.96
Organism:Serratia marcescens
Description:ChEMBL_562671
Residue:480
BDBM50257245
NameBDBM50257245
TypeSmall organic molecule
Emp. Form.C27H40N8O9
Mol. Mass.620.6547
SMILESCNC(=O)NC(N)=NCCC[C@H](NC(=O)[C@@H](C)NC(=O)[C@H](CC(O)=O)NC(C)=O)C(=O)N(C)[C@@H](Cc1ccccc1)C(O)=O