Reaction Details
TargetTyrosine-protein kinase ABL1
LigandBDBM50256976
Substrate/Competitorn/a
Meas. Tech.ChEMBL_562750 (CHEMBL1022422)
IC50 5300±n/a nM
Citation Mahboobi, SDove, SSellmer, AWinkler, MEichhorn, EPongratz, HCiossek, TBaer, TMaier, TBeckers, T Design of chimeric histone deacetylase- and tyrosine kinase-inhibitors: a series of imatinib hybrides as potent inhibitors of wild-type and mutant BCR-ABL, PDGF-Rbeta, and histone deacetylases. J Med Chem52:2265-79 (2009) 
 
Tyrosine-protein kinase ABL1
Name:Tyrosine-protein kinase ABL1
Type:Enzyme
Mol. Mass.:122897.30
Organism:Homo sapiens (Human)
Description:P00519
Residue:1130
BDBM50256976
NameBDBM50256976
Synonyms:CHEMBL475820 | N1-(2-aminophenyl)-N4-(4-methyl-3-(4-(pyridin-3-yl)pyrimidin-2-ylamino)phenyl)terephthalamide
TypeSmall organic molecule
Emp. Form.C30H25N7O2
Mol. Mass.515.5652
SMILESCc1ccc(NC(=O)c2ccc(cc2)C(=O)Nc2ccccc2N)cc1Nc1ncc(cn1)-c1cccnc1