Reaction Details
TargetTyrosine-protein kinase ABL1
LigandBDBM50257078
Substrate/Competitorn/a
Meas. Tech.ChEMBL_562750 (CHEMBL1022422)
IC50 24000±n/a nM
Citation Mahboobi, SDove, SSellmer, AWinkler, MEichhorn, EPongratz, HCiossek, TBaer, TMaier, TBeckers, T Design of chimeric histone deacetylase- and tyrosine kinase-inhibitors: a series of imatinib hybrides as potent inhibitors of wild-type and mutant BCR-ABL, PDGF-Rbeta, and histone deacetylases. J Med Chem52:2265-79 (2009) 
 
Tyrosine-protein kinase ABL1
Name:Tyrosine-protein kinase ABL1
Type:Enzyme
Mol. Mass.:122897.30
Organism:Homo sapiens (Human)
Description:P00519
Residue:1130
BDBM50257078
NameBDBM50257078
Synonyms:CHEMBL474863 | N2-(2-aminophenyl)-N5-(3-(4-(pyridin-3-yl)thiazol-2-ylamino)phenyl)pyridine-2,5-dicarboxamide
TypeSmall organic molecule
Emp. Form.C27H21N7O2S
Mol. Mass.507.566
SMILESNc1ccccc1NC(=O)c1ccc(cn1)C(=O)Nc1cccc(Nc2ncc(s2)-c2cccnc2)c1