Reaction Details
TargetHistone deacetylase 1
LigandBDBM50257029
Substrate/Competitorn/a
Meas. Tech.ChEMBL_562746 (CHEMBL1022418)
IC50 620±n/a nM
Citation Mahboobi, SDove, SSellmer, AWinkler, MEichhorn, EPongratz, HCiossek, TBaer, TMaier, TBeckers, T Design of chimeric histone deacetylase- and tyrosine kinase-inhibitors: a series of imatinib hybrides as potent inhibitors of wild-type and mutant BCR-ABL, PDGF-Rbeta, and histone deacetylases. J Med Chem52:2265-79 (2009) 
 
Histone deacetylase 1
Name:Histone deacetylase 1
Type:Enzyme
Mol. Mass.:55090.27
Organism:Homo sapiens (Human)
Description:Q13547
Residue:482
BDBM50257029
NameBDBM50257029
Synonyms:CHEMBL515258 | N2-(2-aminophenyl)-N5-(4-methyl-3-(4-(pyridin-3-yl)pyrimidin-2-ylamino)phenyl)pyridine-2,5-dicarboxamide
TypeSmall organic molecule
Emp. Form.C29H24N8O2
Mol. Mass.516.5533
SMILESCc1ccc(NC(=O)c2ccc(nc2)C(=O)Nc2ccccc2N)cc1Nc1ncc(cn1)-c1cccnc1