Reaction Details
TargetVascular endothelial growth factor receptor 2
LigandBDBM50257030
Substrate/Competitorn/a
Meas. Tech.ChEMBL_562753 (CHEMBL1022425)
IC50 11000±n/a nM
Citation Mahboobi, SDove, SSellmer, AWinkler, MEichhorn, EPongratz, HCiossek, TBaer, TMaier, TBeckers, T Design of chimeric histone deacetylase- and tyrosine kinase-inhibitors: a series of imatinib hybrides as potent inhibitors of wild-type and mutant BCR-ABL, PDGF-Rbeta, and histone deacetylases. J Med Chem52:2265-79 (2009) 
 
Vascular endothelial growth factor receptor 2
Name:Vascular endothelial growth factor receptor 2
Type:Receptor Tyrosine Kinase
Mol. Mass.:151510.97
Organism:Homo sapiens (Human)
Description:P35968
Residue:1356
BDBM50257030
NameBDBM50257030
Synonyms:CHEMBL473825 | N2-(2-aminophenyl)-N5-(4-methyl-3-(4-(pyridin-3-yl)pyrimidin-2-ylamino)phenyl)thiophene-2,5-dicarboxamide
TypeSmall organic molecule
Emp. Form.C28H23N7O2S
Mol. Mass.521.593
SMILESCc1ccc(NC(=O)c2ccc(s2)C(=O)Nc2ccccc2N)cc1Nc1ncc(cn1)-c1cccnc1