Reaction Details
TargetHistone deacetylase 6
LigandBDBM50257115
Substrate/Competitorn/a
Meas. Tech.ChEMBL_562747 (CHEMBL1022419)
IC50>100000±n/a nM
Citation Mahboobi, SDove, SSellmer, AWinkler, MEichhorn, EPongratz, HCiossek, TBaer, TMaier, TBeckers, T Design of chimeric histone deacetylase- and tyrosine kinase-inhibitors: a series of imatinib hybrides as potent inhibitors of wild-type and mutant BCR-ABL, PDGF-Rbeta, and histone deacetylases. J Med Chem52:2265-79 (2009) 
 
Histone deacetylase 6
Name:Histone deacetylase 6
Type:Chromatin regulator; hydrolase; repressor
Mol. Mass.:131381.51
Organism:Homo sapiens (Human)
Description:Q9UBN7
Residue:1215
BDBM50257115
NameBDBM50257115
Synonyms:CHEMBL474046 | N2-(2-aminophenyl)-N5-(4-methyl-3-(5-(pyridin-3-yl)thiazol-2-ylamino)phenyl)pyridine-2,5-dicarboxamide
TypeSmall organic molecule
Emp. Form.C28H23N7O2S
Mol. Mass.521.593
SMILESCc1ccc(NC(=O)c2ccc(nc2)C(=O)Nc2ccccc2N)cc1Nc1ncc(s1)-c1cccnc1