Reaction Details
TargetHistone deacetylase 6
LigandBDBM50257117
Substrate/Competitorn/a
Meas. Tech.ChEMBL_562747 (CHEMBL1022419)
IC50>100000±n/a nM
Citation Mahboobi, SDove, SSellmer, AWinkler, MEichhorn, EPongratz, HCiossek, TBaer, TMaier, TBeckers, T Design of chimeric histone deacetylase- and tyrosine kinase-inhibitors: a series of imatinib hybrides as potent inhibitors of wild-type and mutant BCR-ABL, PDGF-Rbeta, and histone deacetylases. J Med Chem52:2265-79 (2009) 
 
Histone deacetylase 6
Name:Histone deacetylase 6
Type:Chromatin regulator; hydrolase; repressor
Mol. Mass.:131381.51
Organism:Homo sapiens (Human)
Description:Q9UBN7
Residue:1215
BDBM50257117
NameBDBM50257117
Synonyms:CHEMBL515109 | N2-(2-aminophenyl)-N5-(4-methyl-3-(4-(pyridin-3-yl)thiazol-2-ylamino)phenyl)thiophene-2,5-dicarboxamide
TypeSmall organic molecule
Emp. Form.C27H22N6O2S2
Mol. Mass.526.633
SMILESCc1ccc(NC(=O)c2ccc(s2)C(=O)Nc2ccccc2N)cc1Nc1ncc(s1)-c1cccnc1