Reaction Details
TargetPlatelet-derived growth factor receptor beta
LigandBDBM50257031
Substrate/Competitorn/a
Meas. Tech.ChEMBL_562752 (CHEMBL1022424)
IC50 1100±n/a nM
Citation Mahboobi, SDove, SSellmer, AWinkler, MEichhorn, EPongratz, HCiossek, TBaer, TMaier, TBeckers, T Design of chimeric histone deacetylase- and tyrosine kinase-inhibitors: a series of imatinib hybrides as potent inhibitors of wild-type and mutant BCR-ABL, PDGF-Rbeta, and histone deacetylases. J Med Chem52:2265-79 (2009) 
 
Platelet-derived growth factor receptor beta
Name:Platelet-derived growth factor receptor beta
Type:Enzyme
Mol. Mass.:123922.25
Organism:Homo sapiens (Human)
Description:P09619
Residue:1106
BDBM50257031
NameBDBM50257031
Synonyms:CHEMBL473826 | N1-(2-aminophenyl)-N4-(3-(4-(pyridin-3-yl)pyrimidin-2-ylamino)phenyl)terephthalamide
TypeSmall organic molecule
Emp. Form.C29H23N7O2
Mol. Mass.501.5386
SMILESNc1ccccc1NC(=O)c1ccc(cc1)C(=O)Nc1cccc(Nc2ncc(cn2)-c2cccnc2)c1