Reaction Details
TargetPlatelet-derived growth factor receptor beta
LigandBDBM50257153
Substrate/Competitorn/a
Meas. Tech.ChEMBL_562752 (CHEMBL1022424)
IC50 2100±n/a nM
Citation Mahboobi, SDove, SSellmer, AWinkler, MEichhorn, EPongratz, HCiossek, TBaer, TMaier, TBeckers, T Design of chimeric histone deacetylase- and tyrosine kinase-inhibitors: a series of imatinib hybrides as potent inhibitors of wild-type and mutant BCR-ABL, PDGF-Rbeta, and histone deacetylases. J Med Chem52:2265-79 (2009) 
 
Platelet-derived growth factor receptor beta
Name:Platelet-derived growth factor receptor beta
Type:Enzyme
Mol. Mass.:123922.25
Organism:Homo sapiens (Human)
Description:P09619
Residue:1106
BDBM50257153
NameBDBM50257153
Synonyms:CHEMBL521652 | N1-hydroxy-N4-(4-methyl-3-(4-(pyridin-3-yl)thiazol-2-ylamino)phenyl)terephthalamide
TypeSmall organic molecule
Emp. Form.C23H19N5O3S
Mol. Mass.445.494
SMILESCc1ccc(NC(=O)c2ccc(cc2)C(=O)NO)cc1Nc1ncc(s1)-c1cccnc1