Reaction Details
TargetThromboxane A2 receptor
LigandBDBM50277537
Substrate/Competitorn/a
Meas. Tech.ChEMBL_501283 (CHEMBL971469)
Ki 687±n/a nM
Citation Leblanc, YRoy, PDufresne, CLachance, NWang, ZO'Neill, GGreig, GDenis, DMathieu, MCSlipetz, DSawyer, NTsou, N Discovery of potent and selective DP1 receptor antagonists in the azaindole series. Bioorg Med Chem Lett19:2125-8 (2009) 
 
Thromboxane A2 receptor
Name:Thromboxane A2 receptor
Type:Enyzme
Mol. Mass.:37445.28
Organism:Homo sapiens (Human)
Description:P21731
Residue:343
BDBM50277537
NameBDBM50277537
Synonyms:2-(10-(3,4-dichlorophenylthio)-1-ethyl-6,7,8,9-tetrahydropyrido[3,4-b]indolizin-9-yl)acetic acid | CHEMBL521122
TypeSmall organic molecule
Emp. Form.C21H20Cl2N2O2S
Mol. Mass.435.367
SMILESCCc1nccc2n3CCCC(CC(O)=O)c3c(Sc3ccc(Cl)c(Cl)c3)c12