Reaction Details
TargetThromboxane A2 receptor
LigandBDBM50277540
Substrate/Competitorn/a
Meas. Tech.ChEMBL_501283 (CHEMBL971469)
Ki 415±n/a nM
Citation Leblanc, YRoy, PDufresne, CLachance, NWang, ZO'Neill, GGreig, GDenis, DMathieu, MCSlipetz, DSawyer, NTsou, N Discovery of potent and selective DP1 receptor antagonists in the azaindole series. Bioorg Med Chem Lett19:2125-8 (2009) 
 
Thromboxane A2 receptor
Name:Thromboxane A2 receptor
Type:Enyzme
Mol. Mass.:37445.28
Organism:Homo sapiens (Human)
Description:P21731
Residue:343
BDBM50277540
NameBDBM50277540
Synonyms:2-(1-cyclopropyl-9-(3,4-dichlorophenylthio)-7,8-dihydro-6H-pyrido[3,4-b]pyrrolizin-8-yl)acetic acid | CHEMBL482744
TypeSmall organic molecule
Emp. Form.C21H18Cl2N2O2S
Mol. Mass.433.351
SMILESOC(=O)CC1CCn2c1c(Sc1ccc(Cl)c(Cl)c1)c1c(nccc21)C1CC1