Reaction Details
TargetProstaglandin D2 receptor
LigandBDBM50278038
Substrate/Competitorn/a
Meas. Tech.ChEMBL_501282 (CHEMBL971468)
Ki 12±n/a nM
Citation Leblanc, YRoy, PDufresne, CLachance, NWang, ZO'Neill, GGreig, GDenis, DMathieu, MCSlipetz, DSawyer, NTsou, N Discovery of potent and selective DP1 receptor antagonists in the azaindole series. Bioorg Med Chem Lett19:2125-8 (2009) 
 
Prostaglandin D2 receptor
Name:Prostaglandin D2 receptor
Type:Enzyme
Mol. Mass.:40288.87
Organism:Homo sapiens (Human)
Description:Q13258
Residue:359
BDBM50278038
NameBDBM50278038
Synonyms:(+/-)-2-(5-(4-chlorophenylthio)-4-(methylthio)-6,7,8,9-tetrahydropyrido[3,2-b]indolizin-6-yl)acetic acid | CHEMBL482548
TypeSmall organic molecule
Emp. Form.C20H19ClN2O2S2
Mol. Mass.418.96
SMILESCSc1ccnc2n3CCCC(CC(O)=O)c3c(Sc3ccc(Cl)cc3)c12