Reaction Details
TargetProstaglandin D2 receptor
LigandBDBM50277445
Substrate/Competitorn/a
Meas. Tech.ChEMBL_501282 (CHEMBL971468)
Ki 1.4±n/a nM
Citation Leblanc, YRoy, PDufresne, CLachance, NWang, ZO'Neill, GGreig, GDenis, DMathieu, MCSlipetz, DSawyer, NTsou, N Discovery of potent and selective DP1 receptor antagonists in the azaindole series. Bioorg Med Chem Lett19:2125-8 (2009) 
 
Prostaglandin D2 receptor
Name:Prostaglandin D2 receptor
Type:Enzyme
Mol. Mass.:40288.87
Organism:Homo sapiens (Human)
Description:Q13258
Residue:359
BDBM50277445
NameBDBM50277445
Synonyms:2-(9-(3,4-dichlorophenylthio)-1-(methylsulfonyl)-7,8-dihydro-6H-pyrido[3,4-b]pyrrolizin-8-yl)acetic acid | CHEMBL506909
TypeSmall organic molecule
Emp. Form.C19H16Cl2N2O4S2
Mol. Mass.471.377
SMILESCS(=O)(=O)c1nccc2n3CCC(CC(O)=O)c3c(Sc3ccc(Cl)c(Cl)c3)c12