Reaction Details
TargetProstaglandin D2 receptor
LigandBDBM50277446
Substrate/Competitorn/a
Meas. Tech.ChEMBL_501282 (CHEMBL971468)
Ki 2.1±n/a nM
Citation Leblanc, YRoy, PDufresne, CLachance, NWang, ZO'Neill, GGreig, GDenis, DMathieu, MCSlipetz, DSawyer, NTsou, N Discovery of potent and selective DP1 receptor antagonists in the azaindole series. Bioorg Med Chem Lett19:2125-8 (2009) 
 
Prostaglandin D2 receptor
Name:Prostaglandin D2 receptor
Type:Enzyme
Mol. Mass.:40288.87
Organism:Homo sapiens (Human)
Description:Q13258
Residue:359
BDBM50277446
NameBDBM50277446
Synonyms:2-(9-(4-chlorophenylthio)-1-(methylsulfonyl)-7,8-dihydro-6H-pyrido[3,4-b]pyrrolizin-8-yl)acetic acid | CHEMBL514802
TypeSmall organic molecule
Emp. Form.C19H17ClN2O4S2
Mol. Mass.436.932
SMILESCS(=O)(=O)c1nccc2n3CCC(CC(O)=O)c3c(Sc3ccc(Cl)cc3)c12