Reaction Details
TargetProstaglandin D2 receptor
LigandBDBM50277576
Substrate/Competitorn/a
Meas. Tech.ChEMBL_501282 (CHEMBL971468)
Ki 0.880000±n/a nM
Citation Leblanc, YRoy, PDufresne, CLachance, NWang, ZO'Neill, GGreig, GDenis, DMathieu, MCSlipetz, DSawyer, NTsou, N Discovery of potent and selective DP1 receptor antagonists in the azaindole series. Bioorg Med Chem Lett19:2125-8 (2009) 
 
Prostaglandin D2 receptor
Name:Prostaglandin D2 receptor
Type:Enzyme
Mol. Mass.:40288.87
Organism:Homo sapiens (Human)
Description:Q13258
Residue:359
BDBM50277576
NameBDBM50277576
Synonyms:2-(10-(3,4-dichlorophenylthio)-1-isopropyl-6,7,8,9-tetrahydropyrido[3,4-b]indolizin-9-yl)acetic acid | CHEMBL518988
TypeSmall organic molecule
Emp. Form.C22H22Cl2N2O2S
Mol. Mass.449.393
SMILESCC(C)c1nccc2n3CCCC(CC(O)=O)c3c(Sc3ccc(Cl)c(Cl)c3)c12