Reaction Details
TargetProstaglandin D2 receptor
LigandBDBM50277577
Substrate/Competitorn/a
Meas. Tech.ChEMBL_501282 (CHEMBL971468)
Ki 0.530000±n/a nM
Citation Leblanc, YRoy, PDufresne, CLachance, NWang, ZO'Neill, GGreig, GDenis, DMathieu, MCSlipetz, DSawyer, NTsou, N Discovery of potent and selective DP1 receptor antagonists in the azaindole series. Bioorg Med Chem Lett19:2125-8 (2009) 
 
Prostaglandin D2 receptor
Name:Prostaglandin D2 receptor
Type:Enzyme
Mol. Mass.:40288.87
Organism:Homo sapiens (Human)
Description:Q13258
Residue:359
BDBM50277577
NameBDBM50277577
Synonyms:2-(9-(3,4-dichlorophenylthio)-1-isopropyl-7,8-dihydro-6H-pyrido[3,4-b]pyrrolizin-8-yl)acetic acid | CHEMBL483159
TypeSmall organic molecule
Emp. Form.C21H20Cl2N2O2S
Mol. Mass.435.367
SMILESCC(C)c1nccc2n3CCC(CC(O)=O)c3c(Sc3ccc(Cl)c(Cl)c3)c12