Reaction Details
TargetThromboxane A2 receptor
LigandBDBM50277990
Substrate/Competitorn/a
Meas. Tech.ChEMBL_501283 (CHEMBL971469)
Ki 65±n/a nM
Citation Leblanc, YRoy, PDufresne, CLachance, NWang, ZO'Neill, GGreig, GDenis, DMathieu, MCSlipetz, DSawyer, NTsou, N Discovery of potent and selective DP1 receptor antagonists in the azaindole series. Bioorg Med Chem Lett19:2125-8 (2009) 
 
Thromboxane A2 receptor
Name:Thromboxane A2 receptor
Type:Enyzme
Mol. Mass.:37445.28
Organism:Homo sapiens (Human)
Description:P21731
Residue:343
BDBM50277990
NameBDBM50277990
Synonyms:(+/-)-2-(4-(methylsulfonyl)-5-(4-(trifluoromethyl)phenylthio)-6,7,8,9-tetrahydropyrido[3,2-b]indolizin-6-yl)acetic acid | CHEMBL520481
TypeSmall organic molecule
Emp. Form.C21H19F3N2O4S2
Mol. Mass.484.512
SMILESCS(=O)(=O)c1ccnc2n3CCCC(CC(O)=O)c3c(Sc3ccc(cc3)C(F)(F)F)c12