Reaction Details
TargetCytochrome P450 2C9
LigandBDBM50277580
Substrate/Competitorn/a
Meas. Tech.ChEMBL_501339 (CHEMBL1009689)
IC50 2200±n/a nM
Citation Shen, HCDing, FXDeng, QWilsie, LCKrsmanovic, MLTaggart, AKCarballo-Jane, ERen, NCai, TQWu, TJWu, KKCheng, KChen, QWolff, MSTong, XHolt, TGWaters, MGHammond, MLTata, JRColletti, SL Discovery of novel tricyclic full agonists for the G-protein-coupled niacin receptor 109A with minimized flushing in rats. J Med Chem52:2587-602 (2009) 
 
Cytochrome P450 2C9
Name:Cytochrome P450 2C9
Type:Enzyme
Mol. Mass.:55636.33
Organism:Homo sapiens (Human)
Description:P11712
Residue:490
BDBM50277580
NameBDBM50277580
Synonyms:2-(3-(7-hydroxy-4,5-dihydronaphtho[2,1-d]isoxazol-3-yl)propanamido)benzoic acid | CHEMBL483353
TypeSmall organic molecule
Emp. Form.C21H18N2O5
Mol. Mass.378.378
SMILESOC(=O)c1ccccc1NC(=O)CCc1noc-2c1CCc1cc(O)ccc-21