Reaction Details
TargetCytochrome P450 2C9
LigandBDBM50277716
Substrate/Competitorn/a
Meas. Tech.ChEMBL_501339 (CHEMBL1009689)
IC50 2000±n/a nM
Citation Shen, HCDing, FXDeng, QWilsie, LCKrsmanovic, MLTaggart, AKCarballo-Jane, ERen, NCai, TQWu, TJWu, KKCheng, KChen, QWolff, MSTong, XHolt, TGWaters, MGHammond, MLTata, JRColletti, SL Discovery of novel tricyclic full agonists for the G-protein-coupled niacin receptor 109A with minimized flushing in rats. J Med Chem52:2587-602 (2009) 
 
Cytochrome P450 2C9
Name:Cytochrome P450 2C9
Type:Enzyme
Mol. Mass.:55636.33
Organism:Homo sapiens (Human)
Description:P11712
Residue:490
BDBM50277716
NameBDBM50277716
Synonyms:2-(3-(6-fluoro-7-hydroxynaphtho[2,1-d]isoxazol-3-yl)propanamido)cyclohex-1-enecarboxylic acid | CHEMBL483140
TypeSmall organic molecule
Emp. Form.C21H19FN2O5
Mol. Mass.398.3844
SMILESOC(=O)C1=C(CCCC1)NC(=O)CCc1noc2c1ccc1c(F)c(O)ccc21