Reaction Details
TargetCytochrome P450 2C8
LigandBDBM50277580
Substrate/Competitorn/a
Meas. Tech.ChEMBL_501338 (CHEMBL972422)
IC50 5900±n/a nM
Citation Shen, HCDing, FXDeng, QWilsie, LCKrsmanovic, MLTaggart, AKCarballo-Jane, ERen, NCai, TQWu, TJWu, KKCheng, KChen, QWolff, MSTong, XHolt, TGWaters, MGHammond, MLTata, JRColletti, SL Discovery of novel tricyclic full agonists for the G-protein-coupled niacin receptor 109A with minimized flushing in rats. J Med Chem52:2587-602 (2009) 
 
Cytochrome P450 2C8
Name:Cytochrome P450 2C8
Type:Protein
Mol. Mass.:55839.23
Organism:Homo sapiens (Human)
Description:P10632
Residue:490
BDBM50277580
NameBDBM50277580
Synonyms:2-(3-(7-hydroxy-4,5-dihydronaphtho[2,1-d]isoxazol-3-yl)propanamido)benzoic acid | CHEMBL483353
TypeSmall organic molecule
Emp. Form.C21H18N2O5
Mol. Mass.378.378
SMILESOC(=O)c1ccccc1NC(=O)CCc1noc-2c1CCc1cc(O)ccc-21