Reaction Details
TargetHydroxycarboxylic acid receptor 2
LigandBDBM50277677
Substrate/Competitorn/a
Meas. Tech.ChEMBL_501337 (CHEMBL971523)
IC50 18±n/a nM
Citation Shen, HCDing, FXDeng, QWilsie, LCKrsmanovic, MLTaggart, AKCarballo-Jane, ERen, NCai, TQWu, TJWu, KKCheng, KChen, QWolff, MSTong, XHolt, TGWaters, MGHammond, MLTata, JRColletti, SL Discovery of novel tricyclic full agonists for the G-protein-coupled niacin receptor 109A with minimized flushing in rats. J Med Chem52:2587-602 (2009) 
 
Hydroxycarboxylic acid receptor 2
Name:Hydroxycarboxylic acid receptor 2
Type:G Protein-Coupled Receptor (GPCR)
Mol. Mass.:41868.22
Organism:Homo sapiens (Human)
Description:Membranes from CHO cells expressing the recombinant human GPR109A were used in competition binding assay.
Residue:363
BDBM50277677
NameBDBM50277677
Synonyms:2-(3-(3H-benzo[e]indazol-7-yl)propanamido)benzoic acid | CHEMBL485185
TypeSmall organic molecule
Emp. Form.C21H17N3O3
Mol. Mass.359.378
SMILESOC(=O)c1ccccc1NC(=O)CCc1ccc2c3c[nH]nc3ccc2c1