Reaction Details
TargetHydroxycarboxylic acid receptor 2
LigandBDBM50277579
Substrate/Competitorn/a
Meas. Tech.ChEMBL_501336 (CHEMBL971522)
EC50 34±n/a nM
Citation Shen, HCDing, FXDeng, QWilsie, LCKrsmanovic, MLTaggart, AKCarballo-Jane, ERen, NCai, TQWu, TJWu, KKCheng, KChen, QWolff, MSTong, XHolt, TGWaters, MGHammond, MLTata, JRColletti, SL Discovery of novel tricyclic full agonists for the G-protein-coupled niacin receptor 109A with minimized flushing in rats. J Med Chem52:2587-602 (2009) 
 
Hydroxycarboxylic acid receptor 2
Name:Hydroxycarboxylic acid receptor 2
Type:G Protein-Coupled Receptor (GPCR)
Mol. Mass.:41868.22
Organism:Homo sapiens (Human)
Description:Membranes from CHO cells expressing the recombinant human GPR109A were used in competition binding assay.
Residue:363
BDBM50277579
NameBDBM50277579
Synonyms:2-(3-(7-hydroxy-2H-benzo[g]indazol-3-yl)propanamido)benzoic acid | CHEMBL483352
TypeSmall organic molecule
Emp. Form.C21H17N3O4
Mol. Mass.375.3774
SMILESOC(=O)c1ccccc1NC(=O)CCc1[nH]nc2c1ccc1cc(O)ccc21