Reaction Details
TargetHydroxycarboxylic acid receptor 2
LigandBDBM50277676
Substrate/Competitorn/a
Meas. Tech.ChEMBL_501336 (CHEMBL971522)
EC50 2600±n/a nM
Citation Shen, HCDing, FXDeng, QWilsie, LCKrsmanovic, MLTaggart, AKCarballo-Jane, ERen, NCai, TQWu, TJWu, KKCheng, KChen, QWolff, MSTong, XHolt, TGWaters, MGHammond, MLTata, JRColletti, SL Discovery of novel tricyclic full agonists for the G-protein-coupled niacin receptor 109A with minimized flushing in rats. J Med Chem52:2587-602 (2009) 
 
Hydroxycarboxylic acid receptor 2
Name:Hydroxycarboxylic acid receptor 2
Type:G Protein-Coupled Receptor (GPCR)
Mol. Mass.:41868.22
Organism:Homo sapiens (Human)
Description:Membranes from CHO cells expressing the recombinant human GPR109A were used in competition binding assay.
Residue:363
BDBM50277676
NameBDBM50277676
Synonyms:2-(3-(8-hydroxy-5-methyl-6-oxo-5,6-dihydrophenanthridin-3-yl)propanamido)benzoic acid | CHEMBL485184
TypeSmall organic molecule
Emp. Form.C24H20N2O5
Mol. Mass.416.426
SMILESCn1c2cc(CCC(=O)Nc3ccccc3C(O)=O)ccc2c2ccc(O)cc2c1=O