Reaction Details
TargetHydroxycarboxylic acid receptor 2
LigandBDBM50277715
Substrate/Competitorn/a
Meas. Tech.ChEMBL_501336 (CHEMBL971522)
EC50 6.5±n/a nM
Citation Shen, HCDing, FXDeng, QWilsie, LCKrsmanovic, MLTaggart, AKCarballo-Jane, ERen, NCai, TQWu, TJWu, KKCheng, KChen, QWolff, MSTong, XHolt, TGWaters, MGHammond, MLTata, JRColletti, SL Discovery of novel tricyclic full agonists for the G-protein-coupled niacin receptor 109A with minimized flushing in rats. J Med Chem52:2587-602 (2009) 
 
Hydroxycarboxylic acid receptor 2
Name:Hydroxycarboxylic acid receptor 2
Type:G Protein-Coupled Receptor (GPCR)
Mol. Mass.:41868.22
Organism:Homo sapiens (Human)
Description:Membranes from CHO cells expressing the recombinant human GPR109A were used in competition binding assay.
Residue:363
BDBM50277715
NameBDBM50277715
Synonyms:2-(3-(7-hydroxynaphtho[2,1-d]isoxazol-3-yl)propanamido)cyclohex-1-enecarboxylic acid | CHEMBL483139
TypeSmall organic molecule
Emp. Form.C21H20N2O5
Mol. Mass.380.3939
SMILESOC(=O)C1=C(CCCC1)NC(=O)CCc1noc2c1ccc1cc(O)ccc21