Reaction Details
TargetMuscarinic acetylcholine receptor M3
LigandBDBM50267530
Substrate/Competitorn/a
Meas. Tech.ChEMBL_562970 (CHEMBL1015369)
IC50 104000±n/a nM
Citation Lainé, DIMcCleland, BThomas, SNeipp, CUnderwood, BDufour, JWiddowson, KLPalovich, MRBlaney, FEFoley, JJWebb, EFLuttmann, MABurman, MBelmonte, KSalmon, M Discovery of novel 1-azoniabicyclo[2.2.2]octane muscarinic acetylcholine receptor antagonists. J Med Chem52:2493-505 (2009) 
 
Muscarinic acetylcholine receptor M3
Name:Muscarinic acetylcholine receptor M3
Type:Enzyme
Mol. Mass.:66151.03
Organism:Homo sapiens (Human)
Description:P20309
Residue:590
BDBM50267530
NameBDBM50267530
Synonyms:1-Ethyl-4-[hydroxy(diphenyl)methyl]-1-azoniabicyclo[2.2.2]-octane Bromide | CHEMBL491457
TypeSmall organic molecule
Emp. Form.C22H28NO
Mol. Mass.322.4633
SMILESCC[N+]12CCC(CC1)(CC2)C(O)(c1ccccc1)c1ccccc1