Reaction Details
TargetMuscarinic acetylcholine receptor M1
LigandBDBM50267573
Substrate/Competitorn/a
Meas. Tech.ChEMBL_562971 (CHEMBL1015370)
Ki 0.64±n/a nM
Citation Lainé, DIMcCleland, BThomas, SNeipp, CUnderwood, BDufour, JWiddowson, KLPalovich, MRBlaney, FEFoley, JJWebb, EFLuttmann, MABurman, MBelmonte, KSalmon, M Discovery of novel 1-azoniabicyclo[2.2.2]octane muscarinic acetylcholine receptor antagonists. J Med Chem52:2493-505 (2009) 
 
Muscarinic acetylcholine receptor M1
Name:Muscarinic acetylcholine receptor M1
Type:Protein
Mol. Mass.:51442.54
Organism:Homo sapiens (Human)
Description:P11229
Residue:460
BDBM50267573
NameBDBM50267573
Synonyms:4-[Hydroxy(diphenyl)methyl]-1-[3-(phenyloxy)propyl]-1-azoniabicyclo[2.2.2]octane Bromide | CHEMBL524097
TypeSmall organic molecule
Emp. Form.C29H34NO2
Mol. Mass.428.5852
SMILESOC(c1ccccc1)(c1ccccc1)C12CC[N+](CCCOc3ccccc3)(CC1)CC2