Reaction Details
TargetAdenosine receptor A3
LigandBDBM50267397
Substrate/Competitorn/a
Meas. Tech.ChEMBL_562994 (CHEMBL1015331)
Ki 6740±n/a nM
Citation Franchetti, PCappellacci, LVita, PPetrelli, RLavecchia, AKachler, SKlotz, KNMarabese, ILuongo, LMaione, SGrifantini, M N6-Cycloalkyl- and N6-bicycloalkyl-C5'(C2')-modified adenosine derivatives as high-affinity and selective agonists at the human A1 adenosine receptor with antinociceptive effects in mice. J Med Chem52:2393-406 (2009) 
 
Adenosine receptor A3
Name:Adenosine receptor A3
Type:G Protein-Coupled Receptor (GPCR)
Mol. Mass.:36197.32
Organism:Homo sapiens (Human)
Description:P0DMS8
Residue:318
BDBM50267397
NameBDBM50267397
Synonyms:CHEMBL515330 | N6-Cyclopentyl-9H-(2-C-methyl-5-chloro-5-deoxy-beta-D-ribofuranosyl)adenine
TypeSmall organic molecule
Emp. Form.C16H22ClN5O3
Mol. Mass.367.831
SMILESC[C@@]1(O)[C@H](O)[C@@H](CCl)O[C@H]1n1cnc2c(NC3CCCC3)ncnc12