Reaction Details
TargetAdenosine receptor A3
LigandBDBM50267577
Substrate/Competitorn/a
Meas. Tech.ChEMBL_562994 (CHEMBL1015331)
Ki 101±n/a nM
Citation Franchetti, PCappellacci, LVita, PPetrelli, RLavecchia, AKachler, SKlotz, KNMarabese, ILuongo, LMaione, SGrifantini, M N6-Cycloalkyl- and N6-bicycloalkyl-C5'(C2')-modified adenosine derivatives as high-affinity and selective agonists at the human A1 adenosine receptor with antinociceptive effects in mice. J Med Chem52:2393-406 (2009) 
 
Adenosine receptor A3
Name:Adenosine receptor A3
Type:G Protein-Coupled Receptor (GPCR)
Mol. Mass.:36197.32
Organism:Homo sapiens (Human)
Description:P0DMS8
Residue:318
BDBM50267577
NameBDBM50267577
Synonyms:CHEMBL489640 | N6-((+/-)-endo-norborn-2-yl)adenosine
TypeSmall organic molecule
Emp. Form.C17H23N5O4
Mol. Mass.361.3956
SMILESOC[C@H]1O[C@H]([C@H](O)[C@@H]1O)n1cnc2c(NC3CC4CCC3C4)ncnc12