Reaction Details
TargetAdenosine receptor A1
LigandBDBM50267394
Substrate/Competitorn/a
Meas. Tech.ChEMBL_562991 (CHEMBL1015328)
Ki 1.6±n/a nM
Citation Franchetti, PCappellacci, LVita, PPetrelli, RLavecchia, AKachler, SKlotz, KNMarabese, ILuongo, LMaione, SGrifantini, M N6-Cycloalkyl- and N6-bicycloalkyl-C5'(C2')-modified adenosine derivatives as high-affinity and selective agonists at the human A1 adenosine receptor with antinociceptive effects in mice. J Med Chem52:2393-406 (2009) 
 
Adenosine receptor A1
Name:Adenosine receptor A1
Type:G Protein-Coupled Receptor (GPCR)
Mol. Mass.:36520.92
Organism:Homo sapiens (Human)
Description:P30542
Residue:326
BDBM50267394
NameBDBM50267394
Synonyms:2,5'-dichloro-5'-deoxy-N6-cyclopentyladenosine | CHEMBL477445
TypeSmall organic molecule
Emp. Form.C15H19Cl2N5O3
Mol. Mass.388.249
SMILESO[C@@H]1[C@@H](CCl)O[C@H]([C@@H]1O)n1cnc2c(NC3CCCC3)nc(Cl)nc12