Reaction Details
TargetAdenosine receptor A2a
LigandBDBM50267393
Substrate/Competitorn/a
Meas. Tech.ChEMBL_562992 (CHEMBL1015329)
Ki 837±n/a nM
Citation Franchetti, PCappellacci, LVita, PPetrelli, RLavecchia, AKachler, SKlotz, KNMarabese, ILuongo, LMaione, SGrifantini, M N6-Cycloalkyl- and N6-bicycloalkyl-C5'(C2')-modified adenosine derivatives as high-affinity and selective agonists at the human A1 adenosine receptor with antinociceptive effects in mice. J Med Chem52:2393-406 (2009) 
 
Adenosine receptor A2a
Name:Adenosine receptor A2a
Type:G Protein-Coupled Receptor (GPCR)
Mol. Mass.:44716.46
Organism:Homo sapiens (Human)
Description:P29274
Residue:412
BDBM50267393
NameBDBM50267393
Synonyms:CHEMBL477444 | N6-Cyclopentyl-9H-(5-chloro-5-deoxy-beta-D-ribofuranosyl)adenine
TypeSmall organic molecule
Emp. Form.C15H20ClN5O3
Mol. Mass.353.804
SMILESO[C@@H]1[C@@H](CCl)O[C@H]([C@@H]1O)n1cnc2c(NC3CCCC3)ncnc12