Reaction Details
TargetAdenosine receptor A2b
LigandBDBM50267395
Substrate/Competitorn/a
Meas. Tech.ChEMBL_562993 (CHEMBL1015330)
Ki 2740±n/a nM
Citation Franchetti, PCappellacci, LVita, PPetrelli, RLavecchia, AKachler, SKlotz, KNMarabese, ILuongo, LMaione, SGrifantini, M N6-Cycloalkyl- and N6-bicycloalkyl-C5'(C2')-modified adenosine derivatives as high-affinity and selective agonists at the human A1 adenosine receptor with antinociceptive effects in mice. J Med Chem52:2393-406 (2009) 
 
Adenosine receptor A2b
Name:Adenosine receptor A2b
Type:G Protein-Coupled Receptor (GPCR)
Mol. Mass.:36341.22
Organism:Homo sapiens (Human)
Description:n/a
Residue:332
BDBM50267395
NameBDBM50267395
Synonyms:5'-chloro-5'-deoxy-N6-((-endo-norborn-2-yl)adenosine | CHEMBL449575
TypeSmall organic molecule
Emp. Form.C17H22ClN5O3
Mol. Mass.379.841
SMILESO[C@@H]1[C@@H](CCl)O[C@H]([C@@H]1O)n1cnc2c(NC3CC4CCC3C4)ncnc12