Reaction Details
TargetCyclin-dependent kinase 4
LigandBDBM50267398
Substrate/Competitorn/a
Meas. Tech.ChEMBL_563013 (CHEMBL1016197)
IC50 10±n/a nM
Citation Tsou, HRLiu, XBirnberg, GKaplan, JOtteng, MTran, TKutterer, KTang, ZSuayan, RZask, ARavi, MBretz, AGrillo, MMcGinnis, JPRabindran, SKAyral-Kaloustian, SMansour, TS Discovery of 4-(benzylaminomethylene)isoquinoline-1,3-(2H,4H)-diones and 4-[(pyridylmethyl)aminomethylene]isoquinoline-1,3-(2H,4H)-diones as potent and selective inhibitors of the cyclin-dependent kinase 4. J Med Chem52:2289-310 (2009) 
 
Cyclin-dependent kinase 4
Name:Cyclin-dependent kinase 4
Type:Enzyme Subunit
Mol. Mass.:33731.96
Organism:Homo sapiens (Human)
Description:P11802
Residue:303
BDBM50267398
NameBDBM50267398
Synonyms:4-[(3-Hydroxy-4-pyridin-3-yl-benzylamino)-methylene]-6-iodo-4H-isoquinoline-1,3-dione | CHEMBL452447
TypeSmall organic molecule
Emp. Form.C22H16IN3O3
Mol. Mass.497.2852
SMILESOc1cc(CNC=C2C(=O)NC(=O)c3ccc(I)cc23)ccc1-c1cccnc1