Reaction Details
TargetRetinoblastoma-associated protein
LigandBDBM50267481
Substrate/Competitorn/a
Meas. Tech.ChEMBL_563039 (CHEMBL1011869)
IC50 200±n/a nM
Citation Tsou, HRLiu, XBirnberg, GKaplan, JOtteng, MTran, TKutterer, KTang, ZSuayan, RZask, ARavi, MBretz, AGrillo, MMcGinnis, JPRabindran, SKAyral-Kaloustian, SMansour, TS Discovery of 4-(benzylaminomethylene)isoquinoline-1,3-(2H,4H)-diones and 4-[(pyridylmethyl)aminomethylene]isoquinoline-1,3-(2H,4H)-diones as potent and selective inhibitors of the cyclin-dependent kinase 4. J Med Chem52:2289-310 (2009) 
 
Retinoblastoma-associated protein
Name:Retinoblastoma-associated protein
Type:Other Protein Type
Mol. Mass.:106170.80
Organism:Homo sapiens (Human)
Description:P06400
Residue:928
BDBM50267481
NameBDBM50267481
Synonyms:6-tert-Butyl-4-{[(4-hydroxy-5-propoxy-pyridin-2-ylmethyl)-amino]-methylene}-4H-isoquinoline-1,3-dione | CHEMBL515631
TypeSmall organic molecule
Emp. Form.C23H27N3O4
Mol. Mass.409.4782
SMILESCCCOc1cnc(CNC=C2C(=O)NC(=O)c3ccc(cc23)C(C)(C)C)cc1O