Reaction Details
TargetCannabinoid receptor 1
LigandBDBM50267582
Substrate/Competitorn/a
Meas. Tech.ChEMBL_563063 (CHEMBL1011893)
IC50 227±n/a nM
Citation Vachal, PFletcher, JMFong, TMHuang, CCLao, JXiao, JCShen, CPStrack, AMShearman, LStribling, SChen, RZFrassetto, ATong, XWang, JBall, RGTsou, NNHickey, GJThompson, DFFaidley, TDNicolich, SAchanfuo-Yeboah, JHora, DFHale, JJHagmann, WK 1-Sulfonyl-4-acylpiperazines as selective cannabinoid-1 receptor (CB1R) inverse agonists for the treatment of obesity. J Med Chem52:2550-8 (2009) 
 
Cannabinoid receptor 1
Name:Cannabinoid receptor 1
Type:G Protein-Coupled Receptor (GPCR)
Mol. Mass.:52856.55
Organism:Rattus norvegicus (rat)
Description:P20272
Residue:473
BDBM50267582
NameBDBM50267582
Synonyms:(4-(3-cyclopropyl-5-(trifluoromethyl)phenylsulfonyl)piperazin-1-yl)(4-(trifluoromethyl)phenyl)methanone | CHEMBL522114
TypeSmall organic molecule
Emp. Form.C22H20F6N2O3S
Mol. Mass.506.461
SMILESFC(F)(F)c1ccc(cc1)C(=O)N1CCN(CC1)S(=O)(=O)c1cc(cc(c1)C(F)(F)F)C1CC1