Reaction Details
TargetCannabinoid receptor 1
LigandBDBM50267487
Substrate/Competitorn/a
Meas. Tech.ChEMBL_563064 (CHEMBL1011894)
EC50 1.1±n/a nM
Citation Vachal, PFletcher, JMFong, TMHuang, CCLao, JXiao, JCShen, CPStrack, AMShearman, LStribling, SChen, RZFrassetto, ATong, XWang, JBall, RGTsou, NNHickey, GJThompson, DFFaidley, TDNicolich, SAchanfuo-Yeboah, JHora, DFHale, JJHagmann, WK 1-Sulfonyl-4-acylpiperazines as selective cannabinoid-1 receptor (CB1R) inverse agonists for the treatment of obesity. J Med Chem52:2550-8 (2009) 
 
Cannabinoid receptor 1
Name:Cannabinoid receptor 1
Type:G Protein-Coupled Receptor (GPCR)
Mol. Mass.:52868.96
Organism:Homo sapiens (Human)
Description:P21554
Residue:472
BDBM50267487
NameBDBM50267487
Synonyms:1-(4-(3-cyclopropyl-5-(trifluoromethyl)phenylsulfonyl)piperazin-1-yl)-2-(4-(trifluoromethyl)phenyl)ethanone | CHEMBL516900
TypeSmall organic molecule
Emp. Form.C23H22F6N2O3S
Mol. Mass.520.488
SMILESFC(F)(F)c1ccc(CC(=O)N2CCN(CC2)S(=O)(=O)c2cc(cc(c2)C(F)(F)F)C2CC2)cc1