Reaction Details
TargetCannabinoid receptor 1
LigandBDBM50267939
Substrate/Competitorn/a
Meas. Tech.ChEMBL_563052 (CHEMBL1011882)
IC50>10000±n/a nM
Citation Vachal, PFletcher, JMFong, TMHuang, CCLao, JXiao, JCShen, CPStrack, AMShearman, LStribling, SChen, RZFrassetto, ATong, XWang, JBall, RGTsou, NNHickey, GJThompson, DFFaidley, TDNicolich, SAchanfuo-Yeboah, JHora, DFHale, JJHagmann, WK 1-Sulfonyl-4-acylpiperazines as selective cannabinoid-1 receptor (CB1R) inverse agonists for the treatment of obesity. J Med Chem52:2550-8 (2009) 
 
Cannabinoid receptor 1
Name:Cannabinoid receptor 1
Type:G Protein-Coupled Receptor (GPCR)
Mol. Mass.:52868.96
Organism:Homo sapiens (Human)
Description:P21554
Residue:472
BDBM50267939
NameBDBM50267939
Synonyms:CHEMBL484478 | cyclohexyl(3-(naphthalen-1-ylsulfonyl)-3,6-diazabicyclo[3.1.1]heptan-6-yl)methanone
TypeSmall organic molecule
Emp. Form.C22H26N2O3S
Mol. Mass.398.518
SMILESO=C(C1CCCCC1)N1C2CC1CN(C2)S(=O)(=O)c1cccc2ccccc12