Reaction Details
TargetCannabinoid receptor 1
LigandBDBM50267819
Substrate/Competitorn/a
Meas. Tech.ChEMBL_563052 (CHEMBL1011882)
IC50>10000±n/a nM
Citation Vachal, PFletcher, JMFong, TMHuang, CCLao, JXiao, JCShen, CPStrack, AMShearman, LStribling, SChen, RZFrassetto, ATong, XWang, JBall, RGTsou, NNHickey, GJThompson, DFFaidley, TDNicolich, SAchanfuo-Yeboah, JHora, DFHale, JJHagmann, WK 1-Sulfonyl-4-acylpiperazines as selective cannabinoid-1 receptor (CB1R) inverse agonists for the treatment of obesity. J Med Chem52:2550-8 (2009) 
 
Cannabinoid receptor 1
Name:Cannabinoid receptor 1
Type:G Protein-Coupled Receptor (GPCR)
Mol. Mass.:52868.96
Organism:Homo sapiens (Human)
Description:P21554
Residue:472
BDBM50267819
NameBDBM50267819
Synonyms:CHEMBL522945 | N-(1-(3,5-bis(trifluoromethyl)phenylsulfonyl)azetidin-3-yl)-2-(4-(trifluoromethyl)phenyl)acetamide
TypeSmall organic molecule
Emp. Form.C20H15F9N2O3S
Mol. Mass.534.395
SMILESFC(F)(F)c1ccc(CC(=O)NC2CN(C2)S(=O)(=O)c2cc(cc(c2)C(F)(F)F)C(F)(F)F)cc1