Reaction Details
TargetCannabinoid receptor 1
LigandBDBM50267904
Substrate/Competitorn/a
Meas. Tech.ChEMBL_563053 (CHEMBL1011883)
EC50 8±n/a nM
Citation Vachal, PFletcher, JMFong, TMHuang, CCLao, JXiao, JCShen, CPStrack, AMShearman, LStribling, SChen, RZFrassetto, ATong, XWang, JBall, RGTsou, NNHickey, GJThompson, DFFaidley, TDNicolich, SAchanfuo-Yeboah, JHora, DFHale, JJHagmann, WK 1-Sulfonyl-4-acylpiperazines as selective cannabinoid-1 receptor (CB1R) inverse agonists for the treatment of obesity. J Med Chem52:2550-8 (2009) 
 
Cannabinoid receptor 1
Name:Cannabinoid receptor 1
Type:G Protein-Coupled Receptor (GPCR)
Mol. Mass.:52868.96
Organism:Homo sapiens (Human)
Description:P21554
Residue:472
BDBM50267904
NameBDBM50267904
Synonyms:CHEMBL504182 | cyclohexyl((2R,6S)-2,6-dimethyl-4-(naphthalen-1-ylsulfonyl)piperazin-1-yl)methanone
TypeSmall organic molecule
Emp. Form.C23H30N2O3S
Mol. Mass.414.561
SMILESC[C@H]1CN(C[C@@H](C)N1C(=O)C1CCCCC1)S(=O)(=O)c1cccc2ccccc12