Reaction Details
TargetCannabinoid receptor 1
LigandBDBM50267616
Substrate/Competitorn/a
Meas. Tech.ChEMBL_563052 (CHEMBL1011882)
IC50 8±n/a nM
Citation Vachal, PFletcher, JMFong, TMHuang, CCLao, JXiao, JCShen, CPStrack, AMShearman, LStribling, SChen, RZFrassetto, ATong, XWang, JBall, RGTsou, NNHickey, GJThompson, DFFaidley, TDNicolich, SAchanfuo-Yeboah, JHora, DFHale, JJHagmann, WK 1-Sulfonyl-4-acylpiperazines as selective cannabinoid-1 receptor (CB1R) inverse agonists for the treatment of obesity. J Med Chem52:2550-8 (2009) 
 
Cannabinoid receptor 1
Name:Cannabinoid receptor 1
Type:G Protein-Coupled Receptor (GPCR)
Mol. Mass.:52868.96
Organism:Homo sapiens (Human)
Description:P21554
Residue:472
BDBM50267616
NameBDBM50267616
Synonyms:3-(trifluoromethyl)-5-(4-((1R,2R)-2-(4-(trifluoromethyl)phenyl)cyclopropanecarbonyl)piperazin-1-ylsulfonyl)phenyl propionate | CHEMBL488932
TypeSmall organic molecule
Emp. Form.C25H24F6N2O5S
Mol. Mass.578.524
SMILESCCC(=O)Oc1cc(cc(c1)S(=O)(=O)N1CCN(CC1)C(=O)[C@@H]1C[C@H]1c1ccc(cc1)C(F)(F)F)C(F)(F)F