Reaction Details
TargetCannabinoid receptor 1
LigandBDBM50267871
Substrate/Competitorn/a
Meas. Tech.ChEMBL_563053 (CHEMBL1011883)
EC50 2.5±n/a nM
Citation Vachal, PFletcher, JMFong, TMHuang, CCLao, JXiao, JCShen, CPStrack, AMShearman, LStribling, SChen, RZFrassetto, ATong, XWang, JBall, RGTsou, NNHickey, GJThompson, DFFaidley, TDNicolich, SAchanfuo-Yeboah, JHora, DFHale, JJHagmann, WK 1-Sulfonyl-4-acylpiperazines as selective cannabinoid-1 receptor (CB1R) inverse agonists for the treatment of obesity. J Med Chem52:2550-8 (2009) 
 
Cannabinoid receptor 1
Name:Cannabinoid receptor 1
Type:G Protein-Coupled Receptor (GPCR)
Mol. Mass.:52868.96
Organism:Homo sapiens (Human)
Description:P21554
Residue:472
BDBM50267871
NameBDBM50267871
Synonyms:CHEMBL489852 | cyclohexyl(4-(naphthalen-1-ylsulfonyl)-2-(trifluoromethyl)piperazin-1-yl)methanone
TypeSmall organic molecule
Emp. Form.C22H25F3N2O3S
Mol. Mass.454.506
SMILESFC(F)(F)C1CN(CCN1C(=O)C1CCCCC1)S(=O)(=O)c1cccc2ccccc12