Reaction Details
TargetCannabinoid receptor 1
LigandBDBM50267772
Substrate/Competitorn/a
Meas. Tech.ChEMBL_563053 (CHEMBL1011883)
EC50 1.1±n/a nM
Citation Vachal, PFletcher, JMFong, TMHuang, CCLao, JXiao, JCShen, CPStrack, AMShearman, LStribling, SChen, RZFrassetto, ATong, XWang, JBall, RGTsou, NNHickey, GJThompson, DFFaidley, TDNicolich, SAchanfuo-Yeboah, JHora, DFHale, JJHagmann, WK 1-Sulfonyl-4-acylpiperazines as selective cannabinoid-1 receptor (CB1R) inverse agonists for the treatment of obesity. J Med Chem52:2550-8 (2009) 
 
Cannabinoid receptor 1
Name:Cannabinoid receptor 1
Type:G Protein-Coupled Receptor (GPCR)
Mol. Mass.:52868.96
Organism:Homo sapiens (Human)
Description:P21554
Residue:472
BDBM50267772
NameBDBM50267772
Synonyms:CHEMBL522930 | cyclohexyl(4-(3,5-dimethylphenylsulfonyl)piperazin-1-yl)methanone
TypeSmall organic molecule
Emp. Form.C19H28N2O3S
Mol. Mass.364.502
SMILESCc1cc(C)cc(c1)S(=O)(=O)N1CCN(CC1)C(=O)C1CCCCC1